compilation error

gavinm gavinm gavinm44 at
Sat May 9 08:21:58 EDT 2015


We are trying to build pidgin in windows, refering to this link :

we have completed every steps , whenever trying to make it using

make -f Makefile.mingw install , compilation terminated , please check below :-


$ make -f Makefile.mingw install
(hg --cwd . id -i --debug) 2>/dev/null >package_revision_raw.txt \
|| rm -f package_revision_raw.txt
if [ -f package_revision_raw.txt ]; then \
        sed 's/^\(.\{1,\}\)$/#define REVISION "\1"/'
package_revision_raw.txt > package_revision.h; \
[ -f package_revision.h ] || echo "#define REVISION \"unknown\"" >
make -C ./libpurple -f Makefile.mingw
make[1]: Entering directory
gcc.exe -O2 -Wall -Waggregate-return -Wcast-align
-Wdeclaration-after-statement -Werror-implicit-function-declaration
-Wextra -Wno-sign-compare -Wno-unused-parameter -Winit-self
-Wmissing-declarations -Wmissing-prototypes -Wnested-externs
-Wpointer-arith -Wundef -Wstack-protector -fwrapv -fno-strict-overflow
-Wno-missing-field-initializers -Wformat-security
-fstack-protector-all --param ssp-buffer-size=1 -pipe -mms-bitfields
-I../libpurple -I../libpurple/win32 -I..
-I../../win32-dev/libxml2-2.9.0/include/libxml2 -o account.o -c
In file included from account.c:26:0:
internal.h:105:21: fatal error: gmodule.h: No such file or directory
 #include <gmodule.h>
compilation terminated.
../libpurple/win32/rules.mak:4: recipe for target 'account.o' failed
make[1]: *** [account.o] Error 1
make[1]: Leaving directory
Makefile.mingw:102: recipe for target 'all' failed
make: *** [all] Error 2


Please help
-------------- next part --------------
An HTML attachment was scrubbed...
URL: <>

More information about the Support mailing list